United StatesChange Country, Oracle Worldwide Web Sites Communities I am a... I want to...
Bug ID: JDK-7174440 JDK6-open build breakage
JDK-7174440 : JDK6-open build breakage

Details
Type:
Bug
Submit Date:
2012-06-05
Status:
Resolved
Updated Date:
2012-06-13
Project Name:
JDK
Resolved Date:
2012-06-13
Component:
infrastructure
OS:
windows
Sub-Component:
build
CPU:
generic
Priority:
P1
Resolution:
Fixed
Affected Versions:
OpenJDK6
Fixed Versions:
OpenJDK6 (b26)

Related Reports
Relates:

Sub Tasks

Description
6610244: modal dialog closes with fatal error if    -Xcheck:jni is set   Andrew Hughes  

in jdk6-open master forest, windows build is broken.

C:/PROGRA~1/MICROS~1.NET/Vc7/bin/cl  -O2 -Zi -nologo -MD /D _STATIC_CPPLIB  -FdC:/jprt/T/P1/200457~1.JIT/s/build/WINDOW~1/tmp/sun/sun.awt/awt/obj/awt_Window.pdb -FmC:/jprt/T/P1/200457~1.JIT/s/build/WINDOW~1/tmp/sun/sun.awt/awt/obj/awt_Window.map -W3 -DD3D_OVERLOADS -GX -DUNICODE -D_UNICODE  -DWIN32 -DIAL -D_LITTLE_ENDIAN -DWIN32 -D_X86_ -Dx86  -DWIN32_LEAN_AND_MEAN -I. -IC:/jprt/T/P1/200457~1.JIT/s/build/WINDOW~1/tmp/sun/sun.awt/awt/CClassHeaders -I../../../src/windows/javavm/export -I../../../src/share/javavm/export -I../../../src/share/javavm/include -I../../../src/windows/javavm/include -I../../../src/share/native/common -I../../../src/windows/native/common -I../../../src/share/native/sun/awt -I../../../src/windows/native/sun/awt -IC:/jprt/T/P1/200457~1.JIT/s/build/WINDOW~1/tmp/sun/sun.awt/awt/CClassHeaders/../../java/jvm -IC:/jprt/T/P1/200457~1.JIT/s/build/WINDOW~1/tmp/sun/sun.awt/awt/obj -I../../../src/share/native/common -I../../../src/windows/native/sun/windows -IC:/d
!
 xsdk/Inc

lude -I../../../src/share/native/sun/awt/image/cvutils -I../../../src/share/native/sun/awt/image -I../../../src/share/native/sun/java2d/loops -I../../../src/share/native/sun/java2d -I../../../src/windows/native/sun/java2d -I../../../src/share/native/sun/java2d/opengl -I../../../src/windows/native/sun/java2d/d3d -I../../../src/windows/native/sun/java2d/opengl -I../../../src/windows/native/sun/java2d/windows -I../../../src/share/native/sun/font -I../../../src/share/native/sun/java2d/pipe -I../../../src/share/native/sun/dc/path -I../../../src/share/native/sun/dc/doe -I../../../src/share/native/sun/awt/debug -I../../../src/windows/native/sun/awt  -I../../../src/share/native/sun/awt/medialib   -DINTERNAL_BUILD  -c -FoC:/jprt/T/P1/200457~1.JIT/s/build/WINDOW~1/tmp/sun/sun.awt/awt/obj/awt_Window.obj  ../../../src/windows/native/sun/windows/awt_Window.cpp
awt_Window.cpp
../../../src\windows\native\sun\windows\awt_Window.cpp(2161) : error C2039: 'wwindowPeerCls' : is not a member of 'AwtWindow'
        c:\jprt\T\P1\200457.jitsaha\s\jdk\src\windows\native\sun\windows\awt_Window.h(51) : see declaration of 'AwtWindow'
../../../src\windows\native\sun\windows\awt_Window.cpp(2161) : error C2065: 'wwindowPeerCls' : undeclared identifier
../../../src\windows\native\sun\windows\awt_Window.cpp(2162) : error C2039: 'getActiveWindowsMID' : is not a member of 'AwtWindow'
        c:\jprt\T\P1\200457.jitsaha\s\jdk\src\windows\native\sun\windows\awt_Window.h(51) : see declaration of 'AwtWindow'
../../../src\windows\native\sun\windows\awt_Window.cpp(2162) : error C2065: 'getActiveWindowsMID' : undeclared identifier
make[4]: *** [C:/jprt/T/P1/200457~1.JIT/s/build/WINDOW~1/tmp/sun/sun.awt/awt/obj/awt_Window.obj] Error 2
make[4]: Leaving directory `C:/jprt/T/P1/200457.jitsaha/s/jdk/make/sun/awt'
make[3]: *** [all] Error 1
make[3]: Leaving directory `C:/jprt/T/P1/200457.jitsaha/s/jdk/make/sun'
make[2]: *** [all] Error 1
make[2]: Leaving directory `C:/jprt/T/P1/200457.jitsaha/s/jdk/make'
make[1]: *** [jdk-build] Error 2
make[1]: Leaving directory `C:/jprt/T/P1/200457.jitsaha/s'
make: *** [build_product_image] Error 2
###########################################################
#
# pwd:
#   C:/jprt/T/P1/200457.jitsaha/s
#
# uname -a:
#   Windows_NT JPRT-WIN-X86-2 5 00 586
#
# df -k .:
#   C:/              (C:/)                        215074988/244187964    
#
# free
free: not found
#
# Finished: Fri Jun  1 13:48:18 PDT 2012
#
# returned exit code 2
#
###########################################################

------------------------------------------------------------------------------

                                    

Comments
EVALUATION

part of jdk7 fix was never backported correctly.
                                     
2012-06-06
EVALUATION

http://hg.openjdk.java.net/jdk6/jdk6/jdk/rev/fec31f67f89f
                                     
2012-06-13



Hardware and Software, Engineered to Work Together